ווטסאפ - לינוקס, BSD, קוד פתוח ותוכנה חופשית בעברית. Whatsup - Linux, BSD, open source and free software in Hebrew

 
 
  כניסת חברים · רישום · שכחתי סיסמה  
tux the penguin
תגובה לנושא
צפיה בנושא הבא Printable version התחבר כדי לבדוק הודעות פרטיות צפיה בנושא הקודם
אורח · ·
 

הודעה פורסם: 13/11/2022 - 11:57
נושא ההודעה: עדכון מערכת ארץ' נתקע

מנסה לעדכן מערכת ארץ' וכל פעם העדכון נתקע..
מתבצע תהליך ארוך של משהו שנראה כמו קומפילציה (בסגנון של ג'נטו עם הרבה שורות על המסך) ובסוף המחשב נתקע ולא מסיים.

לא הכי מבין אבל: יש דרך לעקוף את הקומפילציה הזו? אולי יש את הקובץ במצב בינארי כבר? או שצריך להסיר ולהתקין משהו מחדש?

ככה נראה המסך האחרון לפני שנתקע:
קוד:
[ 82%] Building CXX object src/test/librbd/CMakeFiles/unittest_librbd.dir/migration/test_mock_HttpClient.cc.o
cd /home/mgarch_i3/.cache/yay/ceph/src/ceph-17.2.5/build/src/test/librbd && /usr/bin/c++ -DBOOST_ASIO_DISABLE_THREAD_KEYWORD_EXTENSION -DHAVE_CONFIG_H -DTEST_LIBRBD_INTERNALS -D_FILE_OFFSET_BITS=64 -D_FORTIFY_SOURCE=2 -D_GNU_SOURCE -D_REENTRANT -D_THREAD_SAFE -D__CEPH__ -D__STDC_FORMAT_MACROS -D__linux__ -I/home/mgarch_i3/.cache/yay/ceph/src/ceph-17.2.5/build/src/include -I/home/mgarch_i3/.cache/yay/ceph/src/ceph-17.2.5/src -isystem /home/mgarch_i3/.cache/yay/ceph/src/ceph-17.2.5/build/include -isystem /home/mgarch_i3/.cache/yay/ceph/src/ceph-17.2.5/src/xxHash -isystem /home/mgarch_i3/.cache/yay/ceph/src/ceph-17.2.5/src/rapidjson/include -isystem /home/mgarch_i3/.cache/yay/ceph/src/ceph-17.2.5/src/googletest/googlemock/include -isystem /home/mgarch_i3/.cache/yay/ceph/src/ceph-17.2.5/src/googletest/googlemock -isystem /home/mgarch_i3/.cache/yay/ceph/src/ceph-17.2.5/src/googletest/googletest/include -isystem /home/mgarch_i3/.cache/yay/ceph/src/ceph-17.2.5/src/googletest/googletest -march=x86-64 -mtune=generic -O2 -pipe  -fexceptions         -Wp,-D_FORTIFY_SOURCE=2 -Wformat -Werror=format-security         -fstack-clash-protection -fcf-protection -Wp,-D_GLIBCXX_ASSERTIONS  -DFMT_DEPRECATED_OSTREAM -O2 -g -DNDEBUG -fPIE   -U_FORTIFY_SOURCE -Wall -fno-strict-aliasing -fsigned-char -Wtype-limits -Wignored-qualifiers -Wpointer-arith -Werror=format-security -Winit-self -Wno-unknown-pragmas -Wnon-virtual-dtor -Wno-ignored-qualifiers -ftemplate-depth-1024 -Wpessimizing-move -Wredundant-move -Wstrict-null-sentinel -Woverloaded-virtual -fno-new-ttp-matching -fstack-protector-strong -fdiagnostics-color=auto -fno-builtin-malloc -fno-builtin-calloc -fno-builtin-realloc -fno-builtin-free -std=c++17 -MD -MT src/test/librbd/CMakeFiles/unittest_librbd.dir/migration/test_mock_HttpClient.cc.o -MF CMakeFiles/unittest_librbd.dir/migration/test_mock_HttpClient.cc.o.d -o CMakeFiles/unittest_librbd.dir/migration/test_mock_HttpClient.cc.o -c /home/mgarch_i3/.cache/yay/ceph/src/ceph-17.2.5/src/test/librbd/migration/test_mock_HttpClient.cc
 
   
תגובה  עם ציטוט חזרה למעלה
חזרה לתוכן הדיון
אורח · ·
 

הודעה פורסם: 13/11/2022 - 12:05
נושא ההודעה:

להערכתי זה קורה כי אתה מנסה להתקין חבילה מ AUR.
כלומר אולי אתה משתמש ב yay או paru?
או לחילופין, האם פקודת העדכון שלך משתמשת במילה pacman באופן מפורש או בשם אחר?
 
   
תגובה  עם ציטוט חזרה למעלה
חזרה לתוכן הדיון
אורח · ·
 

הודעה פורסם: 13/11/2022 - 12:16
נושא ההודעה:

אה בעצם רואים בפלט שלך שאתה משתמש בפקודה yay.
אז קודם כל כדי לעדכן חבילות שאינן מ aur אתה יכול להשתמש ב:
קוד:
sudo pacman -Syu

אחרי שכל החבילות יתעדכנו תוכל גם לנסות, אם בא לך, לעדכן את החבילות דרך aur בעזרת yay (כמו שעשיתי כאן).
לגבי אם אפשר למחוק, ניראה שמה שהוא מנסה להתקין זו החבילה ceph שכאן:
https://aur.archlinux.org/packages/ceph
אתה יכול לראות מי צריך אותה (required by).
 
   
תגובה  עם ציטוט חזרה למעלה
חזרה לתוכן הדיון
אורח · ·
 

הודעה פורסם: 13/11/2022 - 12:20
נושא ההודעה:

על פניו ניראה שיש דרך לעקוף את זה.
אם תסיר את ceph ואז תתקין את ceph-bin (בעזרת yay), מניח שתעקוף אותו.
ceph-bin אמורה להיות בינארית ללא קומפילציה.
בכל אופן אם תהיינה בעיות אני אומר לך מראש שאיני אחראי Smile.
 
   
תגובה  עם ציטוט חזרה למעלה
חזרה לתוכן הדיון
אורח · ·
 

הודעה פורסם: 13/11/2022 - 13:16
נושא ההודעה:

תודה רבה על ההמלצה! כעת עדכנתי קודם עם פקודת: pacman ולאחר מכן הסרתי את חבילת ceph-libs ואז עדכנתי את המערכת עם yay.

העדכון עבר אבל הסתיים עם הודעת שגיאה שכבר מופיעה לי בכמה עדכונים - הבעיה שאני לא יודע איך להסיר את java ואולי להתקין מחדש לאחר מכן.
אולי יש לי כמה סוגים של java - גם קוד פתוח וגם הקניינית.. לא יודע אם צריך java בכלל..
בכל מקרה הייתי רוצה להפתר ממה שמיותר או להתקין מחדש כדי להמנע מהשגיאה הנ"ל - בקיצור - לא יודע מה הפקודה המדויקת להסרת java?
קוד:
FAILURE: Build failed with an exception.

* What went wrong:
Execution failed for task ':testng-collections:compileJava'.
> invalid source release: 11

* Try:
> Run with --stacktrace option to get the stack trace.
> Run with --info or --debug option to get more log output.

* Get more help at https://help.gradle.org

Deprecated Gradle features were used in this build, making it incompatible with Gradle 8.0.

You can use '--warning-mode all' to show the individual deprecation warnings and determine if they come from your own scripts or plugins.

See https://docs.gradle.org/7.5.1/userguide/command_line_interface.html#sec:command_line_warnings

BUILD FAILED in 2m
65 actionable tasks: 52 executed, 13 up-to-date
==> ERROR: A failure occurred in build().
    Aborting...
 -> error making: java-testng


כאן מה שמופיע בחיפוש חבילות בהקשר של java:
קוד:
yay -Qs java
local/ant 1.10.12-1
    Java based build tool
local/beanshell 2.1.0-1
    Small, free, embeddable, source level Java interpreter with object based scripting language features written in Java
local/ca-certificates-utils 20220905-1
    Common CA certificates (utilities)
local/coffeescript 2.7.0-1
    CoffeeScript is a little language that compiles into JavaScript
local/duktape 2.7.0-4
    Embeddable Javascript engine
local/eclipse-ecj 4.22-2
    Eclipse java bytecode compiler
local/fop 2.7-1
    XSL-FO implementation in Java.
local/gjs 2:1.74.1-1
    Javascript Bindings for GNOME
local/hdf5 1.12.2-1
    General purpose library and file format for storing scientific data
local/java-avalon-framework 4.2.0-9
    Reusable components for J2SE applications.
local/java-batik 1.16-1
    SVG library for Java
local/java-commons-io 2.11.0-1
    IO related classes for Java.
local/java-commons-logging 1.2-3
    Wrapper interface for logging APIs in Java
local/java-environment-common 3-3
    Common files for Java Development Kits
local/java-flexdock 1.2.4-1
    Docking framework for Swing
local/java-hamcrest 1.3-5
    Java matcher objects library
local/java-qdox 2.0.1-1
    A high speed, small footprint parser for extracting class/interface/method definitions from source files complete with JavaDoc @tags
local/java-resolver 1.2-4
    XML entity and URI resolver library
local/java-runtime-common 3-3
    Common files for Java Runtime Environments
local/java-skinlf 6.7-5
    Skinning engine for Swing
local/java-testng 7.5-1
    A testing framework inspired by JUnit and NUnit
local/java-xmlgraphics-commons 2.7-1
    Common components between FOP and Batik
local/java11-openjfx 11.0.16.u2-1
    Java OpenJFX 11 client application platform (open-source implementation of JavaFX)
local/javahelp2 2.0.05.r90-5
    Java based help system
local/jdk11-openjdk 11.0.17.u1-1
    OpenJDK Java 11 development kit
local/jdk8-openjdk 8.352.u08-1
    OpenJDK Java 8 development kit
local/jeuclid-core 3.1.9-1
    MathML renderer for Java
local/jgoodies-looks 2.8.0-4 (jgoodies)
    A Java Swing look and feel library
local/jlatexmath 1.0.7-2
    Java API to display mathematical formulas written in LaTeX
local/jogl 2.3.2-2
    OpenGL bindings for Java
local/jre 19.0.1-1
    Oracle Java Runtime Environment
local/jre11-openjdk 11.0.17.u1-1
    OpenJDK Java 11 full runtime environment
local/jre11-openjdk-headless 11.0.17.u1-1
    OpenJDK Java 11 headless runtime environment
local/jre17-openjdk 17.0.5.u1-1
    OpenJDK Java 17 full runtime environment
local/jre17-openjdk-headless 17.0.5.u1-1
    OpenJDK Java 17 headless runtime environment
local/jre8-openjdk 8.352.u08-1
    OpenJDK Java 8 full runtime environment
local/jre8-openjdk-headless 8.352.u08-1
    OpenJDK Java 8 headless runtime environment
local/js102 102.4.0-1
    JavaScript interpreter and libraries - Version 102
local/js52 52.9.0-4
    JavaScript interpreter and libraries - Version 52
local/js60 60.9.0-2
    JavaScript interpreter and libraries - Version 60
local/js68 68.12.0-1
    JavaScript interpreter and libraries - Version 68
local/js78 78.15.0-4
    JavaScript interpreter and libraries - Version 78
local/js91 91.13.0-1
    JavaScript interpreter and libraries - Version 91
local/log4cplus 2.0.8-1
    A C++ logger very close to Java's log4j
local/maven 3.8.6-1
    Java project management and project comprehension tool
local/nodejs 19.0.1-1
    Evented I/O for V8 javascript
local/python-sphinxcontrib-jsmath 1.0.1-12
    Sphinx extension which renders display math in HTML via JavaScript
local/qt5-declarative 5.15.7+kde+r21-1 (qt qt5)
    Classes for QML and JavaScript languages
local/qt6-declarative 6.4.0-2 (qt6)
    Classes for QML and JavaScript languages
local/qt6-webchannel 6.4.0-1 (qt6)
    Provides access to QObject or QML objects from HTML clients for seamless integration of Qt applications with HTML/JavaScript clients
local/saxon-he 10.6-1
    XSLT 2.0 / XPath 2.0 and 3.0 / XQuery 1.0 and 3.0 processor for Java - Home Edition
local/webkit2gtk 2.38.2-1
    Web content engine for GTK
local/webkit2gtk-4.1 2.38.2-1
    Web content engine for GTK
local/webkit2gtk-5.0 2.38.2-1
    Web content engine for GTK
local/xalan-java 2.7.2-3
    XSLT processor for transforming XML documents into HTML, text, or other XML document types
local/xerces2-java 2.12.1-1
    High performance fully compliant Java XML parser
 
   
תגובה  עם ציטוט חזרה למעלה
חזרה לתוכן הדיון
אורח · ·
 

הודעה פורסם: 13/11/2022 - 14:31
נושא ההודעה:

לא דיברתי על ceph-libs אלא על ceph-bin, שים לב...
ceph-bin זה כמו ceph רק מקומפלת מבעוד מועד ולכן לא תצטרך לקמפל ולהיתקע כמו מקודם.
אגב יש גם ceph-libs-bin שגם היא כבר מקומפלת מבעוד מועד (אם אתה צריך כמובן).

לגבי java אין לי מושג כרגע.
 
   
תגובה  עם ציטוט חזרה למעלה
חזרה לתוכן הדיון
אורח · ·
 

הודעה פורסם: 13/11/2022 - 14:53
נושא ההודעה:

אולי תוכל להעלות קצת יותר טקסט מלפני השגיאה הזו? איזו חבילה מתעדכנת כשזה קורה?
 
   
תגובה  עם ציטוט חזרה למעלה
חזרה לתוכן הדיון
אורח · ·
 

הודעה פורסם: 13/11/2022 - 15:47
נושא ההודעה:

הבנתי שדיברת על BIN אבל ראיתי שאצלי מותקן LIBS והסרתי אותו ולאחר מכן הרצתי עדכון כפי שכתבתי, והופיעה השגיאה של JAVA.. מבדיקה עולה שכרגע לא מותקנת שום חבילה בהקשר של ceph..

הנה הטקסט שלפני:
קוד:
: Proceed with installation? [Y/n]
(1/1) checking keys in keyring                                                                                                                 [########################################################################################] 100%
(1/1) checking package integrity                                                                                                               [########################################################################################] 100%
(1/1) loading package files                                                                                                                    [########################################################################################] 100%
(1/1) checking for file conflicts                                                                                                              [########################################################################################] 100%
(1/1) checking available disk space                                                                                                            [########################################################################################] 100%
:: Processing package changes...
(1/1) upgrading google-chrome                                                                                                                  [########################################################################################] 100%
==> NOTE: Custom flags should be put directly in: ~/.config/chrome-flags.conf
==> NOTE: The launcher is called: 'google-chrome-stable'
:: Running post-transaction hooks...
(1/3) Arming ConditionNeedsUpdate...
(2/3) Updating icon theme caches...
(3/3) Updating the desktop file MIME type cache...
==> Making package: java-testng 7.6.1-1 (12:58:45 2022 נוב 13 א')
==> Checking runtime dependencies...
==> Checking buildtime dependencies...
==> Retrieving sources...
  -> Found java-testng-7.6.1.tar.gz
==> Validating source files with sha256sums...
    java-testng-7.6.1.tar.gz ... Passed
==> Removing existing $srcdir/ directory...
==> Extracting sources...
  -> Extracting java-testng-7.6.1.tar.gz with bsdtar
==> Starting prepare()...
It's recommended to build in a clean chroot
==> Sources are ready.
==> Making package: java-testng 7.6.1-1 (12:58:48 2022 נוב 13 א')
==> Checking runtime dependencies...
==> Checking buildtime dependencies...
==> WARNING: Using existing $srcdir/ tree
==> Removing existing $pkgdir/ directory...
==> Starting build()...
Starting a Gradle Daemon (subsequent builds will be faster)
Type-safe project accessors is an incubating feature.

> Configure project :
Building testng 7.6.1-SNAPSHOT

> Task :build-logic:code-quality:compileKotlin
w: /home/mgarch_i3/.cache/yay/java-testng/src/testng-7.6.1/build-logic/code-quality/src/main/kotlin/testng.testing.gradle.kts: (14, 10): 'forUseAtConfigurationTime(): Provider<T!>' is deprecated. Deprecated in Java

> Task :testng-collections:compileJava FAILED

Build testng-root FAILURE reason:                               
    Execution failed for task ':testng-collections:compileJava':
        java.lang.IllegalArgumentException: invalid source release: 11
            at com.sun.tools.javac.main.OptionHelper$GrumpyHelper.error(OptionHelper.java:103)
            at com.sun.tools.javac.main.Option$11.process(Option.java:204)
            at com.sun.tools.javac.api.JavacTool.processOptions(JavacTool.java:217)
            at com.sun.tools.javac.api.JavacTool.getTask(JavacTool.java:156)
            at com.sun.tools.javac.api.JavacTool.getTask(JavacTool.java:107)
            at com.sun.tools.javac.api.JavacTool.getTask(JavacTool.java:64)
            at org.gradle.api.internal.tasks.compile.JdkTools$DefaultIncrementalAwareCompiler.getTask(JdkTools.java:139)
            at org.gradle.api.internal.tasks.compile.JdkJavaCompiler.createCompileTask(JdkJavaCompiler.java:70)
            at org.gradle.api.internal.tasks.compile.JdkJavaCompiler.execute(JdkJavaCompiler.java:53)
            at org.gradle.api.internal.tasks.compile.JdkJavaCompiler.execute(JdkJavaCompiler.java:39)
            at org.gradle.api.internal.tasks.compile.NormalizingJavaCompiler.delegateAndHandleErrors(NormalizingJavaCompiler.java:97)
            at org.gradle.api.internal.tasks.compile.NormalizingJavaCompiler.execute(NormalizingJavaCompiler.java:51)
            at org.gradle.api.internal.tasks.compile.NormalizingJavaCompiler.execute(NormalizingJavaCompiler.java:37)
            at org.gradle.api.internal.tasks.compile.AnnotationProcessorDiscoveringCompiler.execute(AnnotationProcessorDiscoveringCompiler.java:51)
            at org.gradle.api.internal.tasks.compile.AnnotationProcessorDiscoveringCompiler.execute(AnnotationProcessorDiscoveringCompiler.java:37)
            at org.gradle.api.internal.tasks.compile.ModuleApplicationNameWritingCompiler.execute(ModuleApplicationNameWritingCompiler.java:46)
            at org.gradle.api.internal.tasks.compile.ModuleApplicationNameWritingCompiler.execute(ModuleApplicationNameWritingCompiler.java:36)
            at org.gradle.jvm.toolchain.internal.DefaultToolchainJavaCompiler.execute(DefaultToolchainJavaCompiler.java:57)
            at org.gradle.api.tasks.compile.JavaCompile.lambda$createToolchainCompiler$1(JavaCompile.java:232)
            at org.gradle.api.internal.tasks.compile.CleaningJavaCompiler.execute(CleaningJavaCompiler.java:53)
            at org.gradle.api.internal.tasks.compile.incremental.IncrementalCompilerFactory.lambda$createRebuildAllCompiler$0(IncrementalCompilerFactory.java:52)
            at org.gradle.api.internal.tasks.compile.incremental.SelectiveCompiler.execute(SelectiveCompiler.java:67)
            at org.gradle.api.internal.tasks.compile.incremental.SelectiveCompiler.execute(SelectiveCompiler.java:41)
            at org.gradle.api.internal.tasks.compile.incremental.IncrementalResultStoringCompiler.execute(IncrementalResultStoringCompiler.java:66)
            at org.gradle.api.internal.tasks.compile.incremental.IncrementalResultStoringCompiler.execute(IncrementalResultStoringCompiler.java:52)
            at org.gradle.api.internal.tasks.compile.CompileJavaBuildOperationReportingCompiler$2.call(CompileJavaBuildOperationReportingCompiler.java:59)
            at org.gradle.api.internal.tasks.compile.CompileJavaBuildOperationReportingCompiler$2.call(CompileJavaBuildOperationReportingCompiler.java:51)
            at org.gradle.internal.operations.DefaultBuildOperationRunner$CallableBuildOperationWorker.execute(DefaultBuildOperationRunner.java:204)
            at org.gradle.internal.operations.DefaultBuildOperationRunner$CallableBuildOperationWorker.execute(DefaultBuildOperationRunner.java:199)
            at org.gradle.internal.operations.DefaultBuildOperationRunner$2.execute(DefaultBuildOperationRunner.java:66)
            at org.gradle.internal.operations.DefaultBuildOperationRunner$2.execute(DefaultBuildOperationRunner.java:59)
            at org.gradle.internal.operations.DefaultBuildOperationRunner.execute(DefaultBuildOperationRunner.java:157)
            at org.gradle.internal.operations.DefaultBuildOperationRunner.execute(DefaultBuildOperationRunner.java:59)
            at org.gradle.internal.operations.DefaultBuildOperationRunner.call(DefaultBuildOperationRunner.java:53)
            at org.gradle.internal.operations.DefaultBuildOperationExecutor.call(DefaultBuildOperationExecutor.java:73)
            at org.gradle.api.internal.tasks.compile.CompileJavaBuildOperationReportingCompiler.execute(CompileJavaBuildOperationReportingCompiler.java:51)
            at org.gradle.api.tasks.compile.JavaCompile.performCompilation(JavaCompile.java:279)
            at org.gradle.api.tasks.compile.JavaCompile.performIncrementalCompilation(JavaCompile.java:165)
            at org.gradle.api.tasks.compile.JavaCompile.compile(JavaCompile.java:146)
            at org.gradle.internal.reflect.JavaMethod.invoke(JavaMethod.java:125)
            at org.gradle.api.internal.project.taskfactory.IncrementalInputsTaskAction.doExecute(IncrementalInputsTaskAction.java:32)
            at org.gradle.api.internal.project.taskfactory.StandardTaskAction.execute(StandardTaskAction.java:51)
            at org.gradle.api.internal.project.taskfactory.AbstractIncrementalTaskAction.execute(AbstractIncrementalTaskAction.java:25)
            at org.gradle.api.internal.project.taskfactory.StandardTaskAction.execute(StandardTaskAction.java:29)
            at org.gradle.api.internal.tasks.execution.TaskExecution$3.run(TaskExecution.java:236)
            at org.gradle.internal.operations.DefaultBuildOperationRunner$1.execute(DefaultBuildOperationRunner.java:29)
            at org.gradle.internal.operations.DefaultBuildOperationRunner$1.execute(DefaultBuildOperationRunner.java:26)
            at org.gradle.internal.operations.DefaultBuildOperationRunner$2.execute(DefaultBuildOperationRunner.java:66)
            at org.gradle.internal.operations.DefaultBuildOperationRunner$2.execute(DefaultBuildOperationRunner.java:59)
            at org.gradle.internal.operations.DefaultBuildOperationRunner.execute(DefaultBuildOperationRunner.java:157)
            at org.gradle.internal.operations.DefaultBuildOperationRunner.execute(DefaultBuildOperationRunner.java:59)
            at org.gradle.internal.operations.DefaultBuildOperationRunner.run(DefaultBuildOperationRunner.java:47)
            at org.gradle.internal.operations.DefaultBuildOperationExecutor.run(DefaultBuildOperationExecutor.java:68)
            at org.gradle.api.internal.tasks.execution.TaskExecution.executeAction(TaskExecution.java:221)
            at org.gradle.api.internal.tasks.execution.TaskExecution.executeActions(TaskExecution.java:204)
            at org.gradle.api.internal.tasks.execution.TaskExecution.executeWithPreviousOutputFiles(TaskExecution.java:187)
            at org.gradle.api.internal.tasks.execution.TaskExecution.execute(TaskExecution.java:165)
            at org.gradle.internal.execution.steps.ExecuteStep.executeInternal(ExecuteStep.java:89)
            at org.gradle.internal.execution.steps.ExecuteStep.access$000(ExecuteStep.java:40)
            at org.gradle.internal.execution.steps.ExecuteStep$1.call(ExecuteStep.java:53)
            at org.gradle.internal.execution.steps.ExecuteStep$1.call(ExecuteStep.java:50)
            at org.gradle.internal.operations.DefaultBuildOperationRunner$CallableBuildOperationWorker.execute(DefaultBuildOperationRunner.java:204)
            at org.gradle.internal.operations.DefaultBuildOperationRunner$CallableBuildOperationWorker.execute(DefaultBuildOperationRunner.java:199)
            at org.gradle.internal.operations.DefaultBuildOperationRunner$2.execute(DefaultBuildOperationRunner.java:66)
            at org.gradle.internal.operations.DefaultBuildOperationRunner$2.execute(DefaultBuildOperationRunner.java:59)
            at org.gradle.internal.operations.DefaultBuildOperationRunner.execute(DefaultBuildOperationRunner.java:157)
            at org.gradle.internal.operations.DefaultBuildOperationRunner.execute(DefaultBuildOperationRunner.java:59)
            at org.gradle.internal.operations.DefaultBuildOperationRunner.call(DefaultBuildOperationRunner.java:53)
            at org.gradle.internal.operations.DefaultBuildOperationExecutor.call(DefaultBuildOperationExecutor.java:73)
            at org.gradle.internal.execution.steps.ExecuteStep.execute(ExecuteStep.java:50)
            at org.gradle.internal.execution.steps.ExecuteStep.execute(ExecuteStep.java:40)
            at org.gradle.internal.execution.steps.RemovePreviousOutputsStep.execute(RemovePreviousOutputsStep.java:68)
            at org.gradle.internal.execution.steps.RemovePreviousOutputsStep.execute(RemovePreviousOutputsStep.java:38)
            at org.gradle.internal.execution.steps.CancelExecutionStep.execute(CancelExecutionStep.java:41)
            at org.gradle.internal.execution.steps.TimeoutStep.executeWithoutTimeout(TimeoutStep.java:74)
            at org.gradle.internal.execution.steps.TimeoutStep.execute(TimeoutStep.java:55)
            at org.gradle.internal.execution.steps.CreateOutputsStep.execute(CreateOutputsStep.java:51)
            at org.gradle.internal.execution.steps.CreateOutputsStep.execute(CreateOutputsStep.java:29)
            at org.gradle.internal.execution.steps.CaptureStateAfterExecutionStep.executeDelegateBroadcastingChanges(CaptureStateAfterExecutionStep.java:124)
            at org.gradle.internal.execution.steps.CaptureStateAfterExecutionStep.execute(CaptureStateAfterExecutionStep.java:80)
            at org.gradle.internal.execution.steps.CaptureStateAfterExecutionStep.execute(CaptureStateAfterExecutionStep.java:58)
            at org.gradle.internal.execution.steps.ResolveInputChangesStep.execute(ResolveInputChangesStep.java:48)
            at org.gradle.internal.execution.steps.ResolveInputChangesStep.execute(ResolveInputChangesStep.java:36)
            at org.gradle.internal.execution.steps.BuildCacheStep.executeWithoutCache(BuildCacheStep.java:181)
            at org.gradle.internal.execution.steps.BuildCacheStep.lambda$execute$1(BuildCacheStep.java:71)
            at org.gradle.internal.Either$Right.fold(Either.java:175)
            at org.gradle.internal.execution.caching.CachingState.fold(CachingState.java:59)
            at org.gradle.internal.execution.steps.BuildCacheStep.execute(BuildCacheStep.java:69)
            at org.gradle.internal.execution.steps.BuildCacheStep.execute(BuildCacheStep.java:47)
            at org.gradle.internal.execution.steps.StoreExecutionStateStep.execute(StoreExecutionStateStep.java:36)
            at org.gradle.internal.execution.steps.StoreExecutionStateStep.execute(StoreExecutionStateStep.java:25)
            at org.gradle.internal.execution.steps.RecordOutputsStep.execute(RecordOutputsStep.java:36)
            at org.gradle.internal.execution.steps.RecordOutputsStep.execute(RecordOutputsStep.java:22)
            at org.gradle.internal.execution.steps.SkipUpToDateStep.executeBecause(SkipUpToDateStep.java:110)
            at org.gradle.internal.execution.steps.SkipUpToDateStep.lambda$execute$2(SkipUpToDateStep.java:56)
            at org.gradle.internal.execution.steps.SkipUpToDateStep.execute(SkipUpToDateStep.java:56)
            at org.gradle.internal.execution.steps.SkipUpToDateStep.execute(SkipUpToDateStep.java:38)
            at org.gradle.internal.execution.steps.ResolveChangesStep.execute(ResolveChangesStep.java:73)
            at org.gradle.internal.execution.steps.ResolveChangesStep.execute(ResolveChangesStep.java:44)
            at org.gradle.internal.execution.steps.legacy.MarkSnapshottingInputsFinishedStep.execute(MarkSnapshottingInputsFinishedStep.java:37)
            at org.gradle.internal.execution.steps.legacy.MarkSnapshottingInputsFinishedStep.execute(MarkSnapshottingInputsFinishedStep.java:27)
            at org.gradle.internal.execution.steps.ResolveCachingStateStep.execute(ResolveCachingStateStep.java:89)
            at org.gradle.internal.execution.steps.ResolveCachingStateStep.execute(ResolveCachingStateStep.java:50)
            at org.gradle.internal.execution.steps.ValidateStep.execute(ValidateStep.java:114)
            at org.gradle.internal.execution.steps.ValidateStep.execute(ValidateStep.java:57)
            at org.gradle.internal.execution.steps.CaptureStateBeforeExecutionStep.execute(CaptureStateBeforeExecutionStep.java:76)
            at org.gradle.internal.execution.steps.CaptureStateBeforeExecutionStep.execute(CaptureStateBeforeExecutionStep.java:50)
            at org.gradle.internal.execution.steps.SkipEmptyWorkStep.executeWithNoEmptySources(SkipEmptyWorkStep.java:254)
            at org.gradle.internal.execution.steps.SkipEmptyWorkStep.executeWithNoEmptySources(SkipEmptyWorkStep.java:209)
            at org.gradle.internal.execution.steps.SkipEmptyWorkStep.execute(SkipEmptyWorkStep.java:88)
            at org.gradle.internal.execution.steps.SkipEmptyWorkStep.execute(SkipEmptyWorkStep.java:56)
            at org.gradle.internal.execution.steps.RemoveUntrackedExecutionStateStep.execute(RemoveUntrackedExecutionStateStep.java:32)
            at org.gradle.internal.execution.steps.RemoveUntrackedExecutionStateStep.execute(RemoveUntrackedExecutionStateStep.java:21)
            at org.gradle.internal.execution.steps.legacy.MarkSnapshottingInputsStartedStep.execute(MarkSnapshottingInputsStartedStep.java:38)
            at org.gradle.internal.execution.steps.LoadPreviousExecutionStateStep.execute(LoadPreviousExecutionStateStep.java:43)
            at org.gradle.internal.execution.steps.LoadPreviousExecutionStateStep.execute(LoadPreviousExecutionStateStep.java:31)
            at org.gradle.internal.execution.steps.AssignWorkspaceStep.lambda$execute$0(AssignWorkspaceStep.java:40)
            at org.gradle.api.internal.tasks.execution.TaskExecution$4.withWorkspace(TaskExecution.java:281)
            at org.gradle.internal.execution.steps.AssignWorkspaceStep.execute(AssignWorkspaceStep.java:40)
            at org.gradle.internal.execution.steps.AssignWorkspaceStep.execute(AssignWorkspaceStep.java:30)
            at org.gradle.internal.execution.steps.IdentityCacheStep.execute(IdentityCacheStep.java:37)
            at org.gradle.internal.execution.steps.IdentityCacheStep.execute(IdentityCacheStep.java:27)
            at org.gradle.internal.execution.steps.IdentifyStep.execute(IdentifyStep.java:44)
            at org.gradle.internal.execution.steps.IdentifyStep.execute(IdentifyStep.java:33)


FAILURE: Build failed with an exception.
 
   
תגובה  עם ציטוט חזרה למעלה
חזרה לתוכן הדיון
אורח · ·
 

הודעה פורסם: 13/11/2022 - 17:44
נושא ההודעה:

נראה שהבעיה נפתרה. הלכתי לפי הפקודה בקישור הבא והסרתי את JAVA. במקרה שלי זה היה גרסה 8:
https://superuser.com/questions/1306687/how-to-uninstall-java-9-using-pacman-target-not-found

לאחר בצעתי עדכון וכעת נראה שהכל בסדר. אם יהיה צורך ב JAVA אתקין מחדש..

תודה
 
   
תגובה  עם ציטוט חזרה למעלה
חזרה לתוכן הדיון
אורח · ·
 

הודעה פורסם: 13/11/2022 - 18:30
נושא ההודעה:

ישר כח.
על פניו ניראה שמה שהוא ניסה להתקין זה java-testng:
https://aur.archlinux.org/packages/java-testng
אולי היה אפשר להסיר גם אותה ולראות מה קורה לאחר מכן Smile.
 
   
תגובה  עם ציטוט חזרה למעלה
חזרה לתוכן הדיון
אורח · ·
 

הודעה פורסם: 13/11/2022 - 19:43
נושא ההודעה:

ציטוט:
אולי היה אפשר להסיר גם אותה ולראות מה קורה לאחר מכן Smile.

ניסיתי להסיר אותה אבל לא היה ניתן.. כאמור הסרתי לפי הפקודה בקישור. הופיעו כמה תלויות שהייתי צריך להסיר, ואז היה ניתן להסיר את JAVA.

המצב כרגע שהעדכון עובר ללא שגיאות, אבל יש כמה הערות בסוף שאולי גם בהן צריך לטפל ואני לא הכי יודע. הערות על חבילות פייתון שיש עבורן גרסאות יותר מתקדמות, כמה חבילות חסרות ל GNOME, כמה ORPHANED ו Flagged Out Of Date..
קוד:
$ yay -Syu --noconfirm
:: Synchronizing package databases...
 core is up to date
 extra is up to date
 community is up to date
 multilib is up to date
:: Starting full system upgrade...
 there is nothing to do
:: Searching databases for updates...
:: Searching AUR for updates...
 -> python2-contextlib2: local (0.6.0.post1-3) is newer than AUR (0.6.0.post1-2)
 -> python2-pyparsing: local (2.4.7-6) is newer than AUR (2.4.7-1)
 -> python2-zipp: local (1:1.1.1-1) is newer than AUR (1.2.0-1)
 -> Missing AUR Packages:  celt0.5.1  gegl02  glxinfo  gnome-documents  gnome-getting-started-docs  gnome-online-miners  js52  js60  js68  libgweather  libnm-glib  libnm-gtk  libopenaptx  libzapojit  pcmciautils  python-sip-pyqt5  python-sphinxcontrib-websupport  python2-apipkg  python2-iniconfig  python2-ordered-set  python2-pycryptodome  tracker  tracker-miners  vino  w_scan
 -> Orphaned AUR Packages:  idnkit  java-resolver  python2-pycryptodomex  wattman-gtk-git  xalan-java  xerces2-java
 -> Flagged Out Of Date AUR Packages:  etcher-bin  nouveau-fw  python2-pycryptodomex  wattman-gtk-git
 there is nothing to do
 
   
תגובה  עם ציטוט חזרה למעלה
חזרה לתוכן הדיון
astralcלא בפורום כעת ת.הצטרפות: 07/04/2006 · הודעות: 83 ·
 

הודעה פורסם: 13/11/2022 - 20:24
נושא ההודעה:

אני מציע לך להסיר את כל החבילות של של python2-* ואת כל מה שכתוב לך שלא קיים בAUR
בעיקר עם מה שכתוב פה בשביל להסיר מה שלא בשימוש
(גם תעבור על pacman -Qm ותסיר כל מה שאתה יודע שאתה לא צריך)
 
 צפיה בפרופיל המשתמש שלח הודעה פרטית ביקור באתר המפרסם MSN Messenger  
תגובה  עם ציטוט חזרה למעלה
חזרה לתוכן הדיון
אורח · ·
 

הודעה פורסם: 13/11/2022 - 22:00
נושא ההודעה:

ציטוט:
אני מציע לך להסיר את כל החבילות של של python2-* ואת כל מה שכתוב לך שלא קיים בAUR
בעיקר עם מה שכתוב פה בשביל להסיר מה שלא בשימוש

השתמשתי בפקודה בקישור Removing unused packages (orphans) וגם בפקודה הבאה שם: Detecting more unneeded packages ונראה לי שזה עשה ניקיון יסודי..

מבין שבעקרון את כל "הסדר וניקיון" הזה אמור לעשות מנהל החבילות, אבל כנראה שרמת הבלגן שעשיתי גדולה עליו..

תודה רבה!
 
   
תגובה  עם ציטוט חזרה למעלה
חזרה לתוכן הדיון
אורח · ·
 

הודעה פורסם: 13/11/2022 - 22:05
נושא ההודעה:

האמת שלא.
מדי פעם יש יתומים שצריך להסיר.
גם שים לב שהמערכת מתנפחת מעדכוני חבילות ולפעמים צריך לנקות אותה (להסיר חבילות ישנות שסתם יושבות שם ולא מותקנות כי הן כבר עודכנו...).
אני ממשיך לעשות את זה בקביעות עם pacman -Scc אבל הבנתי שזה אולי פחות מומלץ היום ויש גם דברים אחרים שאפשר לנסות.
ראה כאן:
https://wiki.archlinux.org/title/Pacman#Cleaning_the_package_cache
 
   
תגובה  עם ציטוט חזרה למעלה
חזרה לתוכן הדיון
אורח · ·
 

הודעה פורסם: 14/11/2022 - 21:39
נושא ההודעה:

עם כל הניקיון המועיל שעשיתי למערכת, צריך לציין שעדיף לשים לב למה בדיוק אמור להמחק בתהליך, ולא כפי שאני פעלתי וזרמתי על בליינד.. Sad

נראה שלא נגרם נזק רציני אבל נמחקו משום מה קבצי FONTS שונים, שהייתי צריך לשחזר כדי שהמערכת תציג כתב וסימבולים כפי שהציגה לפני כן.

לא נורא אבל להבא אשים לב יותר.. סהכ המערכת הרבה יותר נקיה עכשיו והעדכונים אמורים לרוץ בלי בעיות Laughing
 
   
תגובה  עם ציטוט חזרה למעלה
חזרה לתוכן הדיון
הצגת הודעות מלפני:     
מעבר אל:  
כל הזמנים הם GMT + 2 שעות
תגובה לנושא
צפיה בנושא הבא Printable version התחבר כדי לבדוק הודעות פרטיות צפיה בנושא הקודם
PNphpBB2 © 2003-2004 

תוכן הדיון

  1. אורח
  2. אורח
  3. אורח
  4. אורח
  5. אורח
  6. אורח
  7. אורח
  8. אורח
  9. אורח
  10. אורח
  11. אורח
  12. astralc
  13. אורח
  14. אורח
  15. אורח